Reaction Details
TargetMu-type opioid receptor
LigandBDBM50276568
Substrate/Competitorn/a
Meas. Tech.Opioid Receptor Binding Assay
Ki 0.540±n/a nM
Citation Blumberg, LCDeaver, DREyerman, DJWynn, TA Methods for treating depressive symptoms US Patent US10231963 Publication Date 3/19/2019
 
Mu-type opioid receptor
Name:Mu-type opioid receptor
Type:G Protein-Coupled Receptor (GPCR)
Mol. Mass.:44789.51
Organism:Homo sapiens (Human)
Description:P35372
Residue:400
BDBM50276568
NameBDBM50276568
Synonyms:CHEMBL1685 Dalgan US9656961, Example 00124 | WY-16225
TypeSmall organic molecule
Emp. Form.C16H23NO
Mol. Mass.245.3599
SMILESC[C@@]12CCCCC[C@@H](Cc3ccc(O)cc13)[C@@H]2N