Reaction Details
TargetMu-type opioid receptor
LigandBDBM50001023
Substrate/Competitorn/a
Meas. Tech.Opioid Receptor Binding Assay
Ki 0.080±n/a nM
Citation Blumberg, LCDeaver, DREyerman, DJWynn, TA Methods for treating depressive symptoms US Patent US10231963 Publication Date 3/19/2019
 
Mu-type opioid receptor
Name:Mu-type opioid receptor
Type:G Protein-Coupled Receptor (GPCR)
Mol. Mass.:44789.51
Organism:Homo sapiens (Human)
Description:P35372
Residue:400
BDBM50001023
NameBDBM50001023
Synonyms:(2R,6R,11R)-3-Cyclopropylmethyl-6,11-dimethyl-1,2,3,4,5,6-hexahydro-2,6-methano-benzo[d]azocin-8-ol CHEMBL56585 US10231963, Table B.9 US11534436, Compound Table B.9 | US9656961, Example 00126
TypeSmall organic molecule
Emp. Form.C18H25NO
Mol. Mass.271.3972
SMILESC[C@H]1[C@H]2Cc3ccc(O)cc3[C@]1(C)CCN2CC1CC1