Reaction Details
TargetMu-type opioid receptor
LigandBDBM50303848
Substrate/Competitorn/a
Meas. Tech.Opioid Receptor Binding Assay
Ki 0.490±n/a nM
Citation Blumberg, LCDeaver, DREyerman, DJWynn, TA Methods for treating depressive symptoms US Patent US10231963 Publication Date 3/19/2019
 
Mu-type opioid receptor
Name:Mu-type opioid receptor
Type:G Protein-Coupled Receptor (GPCR)
Mol. Mass.:44789.51
Organism:Homo sapiens (Human)
Description:P35372
Residue:400
BDBM50303848
NameBDBM50303848
Synonyms:(+)-trans-3-Methyl-2,3,4,4aalpha,5,6,7,7aalpha-octahydro-1H-benzo-[4,5]furo[3,2-e]isoquinolin-9-ol CHEMBL571843 | US10231963, Table B.12
TypeSmall organic molecule
Emp. Form.C16H21NO2
Mol. Mass.259.3434
SMILESCN1CC[C@]23[C@H](CCC[C@H]2C1)Oc1c3cccc1O