Reaction Details
TargetMu-type opioid receptor
LigandBDBM179876
Substrate/Competitorn/a
Meas. Tech.Opioid Receptor Binding Assay
IC50 14.0±n/a nM
Citation Blumberg, LCDeaver, DREyerman, DJWynn, TA Methods for treating depressive symptoms US Patent US10231963 Publication Date 3/19/2019
 
Mu-type opioid receptor
Name:Mu-type opioid receptor
Type:G Protein-Coupled Receptor (GPCR)
Mol. Mass.:44789.51
Organism:Homo sapiens (Human)
Description:P35372
Residue:400
BDBM179876
NameBDBM179876
Synonyms:US10231963, Table B.22 US10736890, Compound TABLE B.22 US11534436, Compound Table B.22 US9656961, Example 00139
TypeSmall organic molecule
Emp. Form.C22H30N2O3
Mol. Mass.370.4852
SMILESNC(=O)c1ccc2C[C@@H]3[C@@H]4CC[C@H](O)C[C@]4(CCN3CC3CCC3)c2c1O