Reaction Details
TargetMu-type opioid receptor
LigandBDBM369488
Substrate/Competitorn/a
Meas. Tech.Opioid Receptor Binding Assay
Ki 0.190±n/a nM
Citation Blumberg, LCDeaver, DREyerman, DJWynn, TA Methods for treating depressive symptoms US Patent US10231963 Publication Date 3/19/2019
 
Mu-type opioid receptor
Name:Mu-type opioid receptor
Type:G Protein-Coupled Receptor (GPCR)
Mol. Mass.:44789.51
Organism:Homo sapiens (Human)
Description:P35372
Residue:400
BDBM369488
NameBDBM369488
Synonyms:US10231963, Table B.28 US11534436, Compound Table B.28
TypeSmall organic molecule
Emp. Form.C19H27NO
Mol. Mass.285.4238
SMILESC[C@H](C1CC1)N1CC[C@@]2(C)[C@@H](C)[C@H]1Cc1ccc(O)cc21