Reaction Details
TargetMu-type opioid receptor
LigandBDBM179900
Substrate/Competitorn/a
Meas. Tech.Opioid Receptor Binding Assay
Ki 1.20±n/a nM
Citation Blumberg, LCDeaver, DREyerman, DJWynn, TA Methods for treating depressive symptoms US Patent US10231963 Publication Date 3/19/2019
 
Mu-type opioid receptor
Name:Mu-type opioid receptor
Type:G Protein-Coupled Receptor (GPCR)
Mol. Mass.:44789.51
Organism:Homo sapiens (Human)
Description:P35372
Residue:400
BDBM179900
NameBDBM179900
Synonyms:US10231963, Table C.4 US10736890, Compound TABLE C.4 US11534436, Compound Table C.4 US9656961, Example 00168
TypeSmall organic molecule
Emp. Form.C23H30N2O4
Mol. Mass.398.4953
SMILESC[C@H](C1CCC1)N1CC[C@]23CC(=O)CC[C@@]2(O)[C@H]1Cc1ccc(C(N)=O)c(O)c31