Reaction Details
TargetMu-type opioid receptor
LigandBDBM179903
Substrate/Competitorn/a
Meas. Tech.Opioid Receptor Binding Assay
IC50 1.50±n/a nM
Citation Blumberg, LCDeaver, DREyerman, DJWynn, TA Methods for treating depressive symptoms US Patent US10231963 Publication Date 3/19/2019
 
Mu-type opioid receptor
Name:Mu-type opioid receptor
Type:G Protein-Coupled Receptor (GPCR)
Mol. Mass.:44789.51
Organism:Homo sapiens (Human)
Description:P35372
Residue:400
BDBM179903
NameBDBM179903
Synonyms:US10231963, Table C.7 US10736890, Compound TABLE C.7 US11534436, Compound Table C.7 US9656961, Example 00171
TypeSmall organic molecule
Emp. Form.C21H28N2O
Mol. Mass.324.4598
SMILESNC(=O)c1ccc2C[C@@H]3C4CCCC[C@]4(CCN3CC3CC3)c2c1