Reaction Details
TargetAmyloid-beta precursor protein
LigandBDBM50393100
Substrate/Competitorn/a
Meas. Tech.TR-FRET Assay
IC50 0.630±n/a nM
Citation Csjernyik, GKarlstrom, SKers, AKolmodin, KNylof, MOhberg, LRakos, LSandberg, LSehgelmeble, FSoderman, PSwahn, BVon Berg, S Compounds and their use as BACE inhibitors US Patent US10231967 Publication Date 3/19/2019
 
Amyloid-beta precursor protein
Name:Amyloid-beta precursor protein
Type:Single-pass type I membrane protein
Mol. Mass.:86890.41
Organism:Homo sapiens (Human)
Description:P05067
Residue:770
BDBM50393100
NameBDBM50393100
Synonyms:CHEMBL2152915 US9918985, Example 125
TypeSmall organic molecule
Emp. Form.C25H25ClN4O
Mol. Mass.432.945
SMILESCO[C@H]1CC[C@@]2(Cc3ccc(cc3C22N=C(C)C(N)=N2)-c2cc(Cl)cc(c2)C#N)CC1