Reaction Details
TargetAmyloid-beta precursor protein
LigandBDBM136739
Substrate/Competitorn/a
Meas. Tech.sAPPbeta Release Assay
IC50 0.570±n/a nM
Citation Csjernyik, GKarlstrom, SKers, AKolmodin, KNylof, MOhberg, LRakos, LSandberg, LSehgelmeble, FSoderman, PSwahn, BVon Berg, S Compounds and their use as BACE inhibitors US Patent US10231967 Publication Date 3/19/2019
 
Amyloid-beta precursor protein
Name:Amyloid-beta precursor protein
Type:Single-pass type I membrane protein
Mol. Mass.:86890.41
Organism:Homo sapiens (Human)
Description:P05067
Residue:770
BDBM136739
NameBDBM136739
Synonyms:US10231967, Example 119 US9918985, Example 119
TypeSmall organic molecule
Emp. Form.C23H25ClN4O
Mol. Mass.408.924
SMILESCO[C@H]1CC[C@@]2(Cc3ccc(cc3C22N=C(C)C(N)=N2)-c2cncc(Cl)c2)CC1