Reaction Details
TargetAmyloid-beta precursor protein
LigandBDBM50393102
Substrate/Competitorn/a
Meas. Tech.sAPPbeta Release Assay
IC50 0.560±n/a nM
Citation Csjernyik, GKarlstrom, SKers, AKolmodin, KNylof, MOhberg, LRakos, LSandberg, LSehgelmeble, FSoderman, PSwahn, BVon Berg, S Compounds and their use as BACE inhibitors US Patent US10231967 Publication Date 3/19/2019
 
Amyloid-beta precursor protein
Name:Amyloid-beta precursor protein
Type:Single-pass type I membrane protein
Mol. Mass.:86890.41
Organism:Homo sapiens (Human)
Description:P05067
Residue:770
BDBM50393102
NameBDBM50393102
Synonyms:CHEMBL2152917 US8865911, 20t US8865911, 20t Isomer 2 | US9918985, Example 20t Isomer 1
TypeSmall organic molecule
Emp. Form.C22H31N3O2
Mol. Mass.369.5004
SMILESCO[C@H]1CC[C@@]2(Cc3ccc(OCC(C)C)cc3C22N=C(C)C(N)=N2)CC1