Reaction Details
TargetAmyloid-beta precursor protein
LigandBDBM136761
Substrate/Competitorn/a
Meas. Tech.sAPPbeta Release Assay
IC50 0.630±n/a nM
Citation Csjernyik, GKarlstrom, SKers, AKolmodin, KNylof, MOhberg, LRakos, LSandberg, LSehgelmeble, FSoderman, PSwahn, BVon Berg, S Compounds and their use as BACE inhibitors US Patent US10231967 Publication Date 3/19/2019
 
Amyloid-beta precursor protein
Name:Amyloid-beta precursor protein
Type:Single-pass type I membrane protein
Mol. Mass.:86890.41
Organism:Homo sapiens (Human)
Description:P05067
Residue:770
BDBM136761
NameBDBM136761
Synonyms:US10231967, Example 20u US9000182, 10 | US9918985, Example 20u
TypeSmall organic molecule
Emp. Form.C21H26F3N3O2
Mol. Mass.409.4452
SMILESCO[C@H]1CC[C@@]2(Cc3ccc(OCCC(F)(F)F)cc3C22N=C(C)C(N)=N2)CC1