Reaction Details
TargetAmyloid-beta precursor protein
LigandBDBM136848
Substrate/Competitorn/a
Meas. Tech.sAPPbeta Release Assay
IC50 0.800±n/a nM
Citation Csjernyik, GKarlstrom, SKers, AKolmodin, KNylof, MOhberg, LRakos, LSandberg, LSehgelmeble, FSoderman, PSwahn, BVon Berg, S Compounds and their use as BACE inhibitors US Patent US10231967 Publication Date 3/19/2019
 
Amyloid-beta precursor protein
Name:Amyloid-beta precursor protein
Type:Single-pass type I membrane protein
Mol. Mass.:86890.41
Organism:Homo sapiens (Human)
Description:P05067
Residue:770
BDBM136848
NameBDBM136848
Synonyms:US10231967, Example 85 US9918985, Example 85
TypeSmall organic molecule
Emp. Form.C26H25F3N4O
Mol. Mass.466.4981
SMILESCO[C@H]1CC[C@@]2(Cc3ccc(cc3[C@@]22N=C(C)C(N)=N2)-c2cc(cc(c2)C(F)(F)F)C#N)CC1