Reaction Details
TargetAmyloid-beta precursor protein
LigandBDBM136856
Substrate/Competitorn/a
Meas. Tech.TR-FRET Assay
IC50 0.840±n/a nM
Citation Csjernyik, GKarlstrom, SKers, AKolmodin, KNylof, MOhberg, LRakos, LSandberg, LSehgelmeble, FSoderman, PSwahn, BVon Berg, S Compounds and their use as BACE inhibitors US Patent US10231967 Publication Date 3/19/2019
 
Amyloid-beta precursor protein
Name:Amyloid-beta precursor protein
Type:Single-pass type I membrane protein
Mol. Mass.:86890.41
Organism:Homo sapiens (Human)
Description:P05067
Residue:770
BDBM136856
NameBDBM136856
Synonyms:US10231967, Example 92-Isomer-1 US9918985, Example 92 Isomer 1
TypeSmall organic molecule
Emp. Form.C26H28N4O2
Mol. Mass.428.5261
SMILESCO[C@H]1CC[C@@]2(Cc3ccc(cc3[C@]22N=C(C)C(N)=N2)-c2cc(OC)cc(c2)C#N)CC1