Reaction Details
TargetAmyloid-beta precursor protein
LigandBDBM136858
Substrate/Competitorn/a
Meas. Tech.sAPPbeta Release Assay
IC50 0.560±n/a nM
Citation Csjernyik, GKarlstrom, SKers, AKolmodin, KNylof, MOhberg, LRakos, LSandberg, LSehgelmeble, FSoderman, PSwahn, BVon Berg, S Compounds and their use as BACE inhibitors US Patent US10231967 Publication Date 3/19/2019
 
Amyloid-beta precursor protein
Name:Amyloid-beta precursor protein
Type:Single-pass type I membrane protein
Mol. Mass.:86890.41
Organism:Homo sapiens (Human)
Description:P05067
Residue:770
BDBM136858
NameBDBM136858
Synonyms:US10231967, Example 93 US8865911, 94 Isomer 1 US9918985, Example 94 Isomer 2
TypeSmall organic molecule
Emp. Form.C25H25BrN4O
Mol. Mass.477.396
SMILESCO[C@H]1CC[C@@]2(Cc3ccc(cc3C22N=C(C)C(N)=N2)-c2cc(Br)cc(c2)C#N)CC1