Reaction Details
TargetGalectin-7
LigandBDBM21521
Substrate/CompetitorBDBM21520
Meas. Tech.Fluorescence Polarization Assay
Kd 65000±n/a nM
Citation Salameh, BASundin, ALeffler, HNilsson, UJ Thioureido N-acetyllactosamine derivatives as potent galectin-7 and 9N inhibitors. Bioorg Med Chem14:1215-20 (2006) 
 
Galectin-7
Name:Galectin-7
Type:Galactoside-binding protein
Mol. Mass.:15077.89
Organism:Homo sapiens (Human)
Description:n/a
Residue:136
BDBM21521
BDBM21520
NameBDBM21521
Synonyms:N-[(2R,3R,4R,5S,6R)-5-{[(2S,3R,4S,5R,6R)-3,5-dihydroxy-6-(hydroxymethyl)-4-[(methylcarbamothioyl)amino]oxan-2-yl]oxy}-4-hydroxy-6-(hydroxymethyl)-2-methoxyoxan-3-yl]acetamide | Thioureido N-acetyllactosamine derivative, 5
TypeSmall organic molecule
Emp. Form.C17H31N3O10S
Mol. Mass.469.507
SMILESCNC(=S)N[C@H]1[C@@H](O)[C@@H](CO)O[C@@H](O[C@H]2[C@H](O)[C@@H](NC(C)=O)[C@H](OC)O[C@@H]2CO)[C@@H]1O