Reaction Details
TargetGalectin-8
LigandBDBM21524
Substrate/CompetitorBDBM21520
Meas. Tech.Fluorescence Polarization Assay
Kd>3000000±n/a nM
Citation Salameh, BASundin, ALeffler, HNilsson, UJ Thioureido N-acetyllactosamine derivatives as potent galectin-7 and 9N inhibitors. Bioorg Med Chem14:1215-20 (2006) 
 
Galectin-8
Name:Galectin-8
Type:PROTEIN
Mol. Mass.:35814.23
Organism:Homo sapiens (Human)
Description:ChEMBL_1454625
Residue:317
BDBM21524
BDBM21520
NameBDBM21524
Synonyms:N-[(2R,3R,4R,5S,6R)-5-{[(2S,3R,4S,5R,6R)-4-[(diethylcarbamothioyl)amino]-3,5-dihydroxy-6-(hydroxymethyl)oxan-2-yl]oxy}-4-hydroxy-6-(hydroxymethyl)-2-methoxyoxan-3-yl]acetamide | Thioureido N-acetyllactosamine derivative, 8
Typen/a
Emp. Form.C20H37N3O10S
Mol. Mass.511.587
SMILESCCN(CC)C(=S)N[C@H]1[C@@H](O)[C@@H](CO)O[C@@H](O[C@H]2[C@H](O)[C@@H](NC(C)=O)[C@H](OC)O[C@@H]2CO)[C@@H]1O