Reaction Details
TargetHematopoietic prostaglandin D synthase
LigandBDBM21623
Substrate/CompetitorBDBM21614
Meas. Tech.In Vitro GST Activity Assay
pH7.2±n/a
Temperature295.15±n/a K
IC50 17400±n/a nM
Citation Hohwy, MSpadola, LLundquist, BHawtin, PDahmén, JGroth-Clausen, INilsson, EPersdotter, Svon Wachenfeldt, KFolmer, RHEdman, K Novel prostaglandin d synthase inhibitors generated by fragment-based drug design. J Med Chem51:2178-86 (2008) 
 
Hematopoietic prostaglandin D synthase
Name:Hematopoietic prostaglandin D synthase
Type:Enzyme
Mol. Mass.:23341.07
Organism:Homo sapiens (Human)
Description:The protein was expressed in E. coli strain BL21(DE3) with an N-terminal 6-His tag.
Residue:199
BDBM21623
BDBM21614
NameBDBM21623
Synonyms:2,4-dichloro-6-(1H-pyrazol-5-yl)phenol | Phenol, 11
TypeSmall organic molecule
Emp. Form.C9H6Cl2N2O
Mol. Mass.229.063
SMILESOc1c(Cl)cc(Cl)cc1-c1cc[nH]n1