Reaction Details
TargetHematopoietic prostaglandin D synthase
LigandBDBM21624
Substrate/CompetitorBDBM21614
Meas. Tech.In Vitro GST Activity Assay
pH7.2±n/a
Temperature295.15±n/a K
IC50 138±n/a nM
Citation Hohwy, MSpadola, LLundquist, BHawtin, PDahmén, JGroth-Clausen, INilsson, EPersdotter, Svon Wachenfeldt, KFolmer, RHEdman, K Novel prostaglandin d synthase inhibitors generated by fragment-based drug design. J Med Chem51:2178-86 (2008) 
 
Hematopoietic prostaglandin D synthase
Name:Hematopoietic prostaglandin D synthase
Type:Enzyme
Mol. Mass.:23341.07
Organism:Homo sapiens (Human)
Description:The protein was expressed in E. coli strain BL21(DE3) with an N-terminal 6-His tag.
Residue:199
BDBM21624
BDBM21614
NameBDBM21624
Synonyms:4-{[4-(4-fluoro-3-methylphenyl)-1,3-thiazol-2-yl]amino}-2-hydroxybenzoic acid | Thiazolylamino, 12
TypeSmall organic molecule
Emp. Form.C17H13FN2O3S
Mol. Mass.344.36
SMILESCc1cc(ccc1F)-c1csc(Nc2ccc(C(O)=O)c(O)c2)n1