Reaction Details
TargetHematopoietic prostaglandin D synthase
LigandBDBM21627
Substrate/CompetitorBDBM21614
Meas. Tech.In Vitro GST Activity Assay
pH7.2±n/a
Temperature295.15±n/a K
IC50 75±n/a nM
Citation Hohwy, MSpadola, LLundquist, BHawtin, PDahmén, JGroth-Clausen, INilsson, EPersdotter, Svon Wachenfeldt, KFolmer, RHEdman, K Novel prostaglandin d synthase inhibitors generated by fragment-based drug design. J Med Chem51:2178-86 (2008) 
 
Hematopoietic prostaglandin D synthase
Name:Hematopoietic prostaglandin D synthase
Type:Enzyme
Mol. Mass.:23341.07
Organism:Homo sapiens (Human)
Description:The protein was expressed in E. coli strain BL21(DE3) with an N-terminal 6-His tag.
Residue:199
BDBM21627
BDBM21614
NameBDBM21627
Synonyms:N-[4-methyl-3-({3-[(4-methylpiperazin-1-yl)methyl]benzene}amido)phenyl]-3-phenyl-1,2-thiazole-5-carboxamide Phenylisothiazole-5-carboxamide, 15
TypeSmall organic molecule
Emp. Form.C30H31N5O2S
Mol. Mass.525.664
SMILESCN1CCN(Cc2cccc(c2)C(=O)Nc2cc(NC(=O)c3cc(ns3)-c3ccccc3)ccc2C)CC1