Reaction Details
TargetHematopoietic prostaglandin D synthase
LigandBDBM21629
Substrate/CompetitorBDBM21614
Meas. Tech.In Vitro GST Activity Assay
pH7.2±n/a
Temperature295.15±n/a K
IC50 3800±n/a nM
Citation Hohwy, MSpadola, LLundquist, BHawtin, PDahmén, JGroth-Clausen, INilsson, EPersdotter, Svon Wachenfeldt, KFolmer, RHEdman, K Novel prostaglandin d synthase inhibitors generated by fragment-based drug design. J Med Chem51:2178-86 (2008) 
 
Hematopoietic prostaglandin D synthase
Name:Hematopoietic prostaglandin D synthase
Type:Enzyme
Mol. Mass.:23341.07
Organism:Homo sapiens (Human)
Description:The protein was expressed in E. coli strain BL21(DE3) with an N-terminal 6-His tag.
Residue:199
BDBM21629
BDBM21614
NameBDBM21629
Synonyms:3-(4-methylphenyl)-5H-indeno[1,2-c]pyridazin-5-one cid_2767330
TypeSmall organic molecule
Emp. Form.C18H12N2O
Mol. Mass.272.3007
SMILESCc1ccc(cc1)-c1cc2C(=O)c3ccccc3-c2nn1