Reaction Details
TargetNociceptin receptor
LigandBDBM21847
Substrate/CompetitorBDBM21842
Meas. Tech.Radioligand Binding Assay
pH7.4±n/a
Temperature295.15±n/a K
Ki 8.9±0.2 nM
Citation Mustazza, CBorioni, ASestili, ISbraccia, MRodomonte, ADel Giudice, MR Synthesis and pharmacological evaluation of 1,2-dihydrospiro[isoquinoline-4(3H),4'-piperidin]-3-ones as nociceptin receptor agonists. J Med Chem51:1058-62 (2008) 
 
Nociceptin receptor
Name:Nociceptin receptor
Type:G Protein-Coupled Receptor (GPCR)
Mol. Mass.:40702.87
Organism:Homo sapiens (Human)
Description:P41146
Residue:370
BDBM21847
BDBM21842
NameBDBM21847
Synonyms:7-fluoro-2-methyl-1'-[4-(propan-2-yl)cyclohexyl]-2,3-dihydro-1H-spiro[isoquinoline-4,4'-piperidine]-3-one | Piperidine Derivative, 5l
TypeSmall organic molecule
Emp. Form.C23H33FN2O
Mol. Mass.372.5193
SMILESCC(C)C1CCC(CC1)N1CCC2(CC1)C(=O)N(C)Cc1cc(F)ccc21