Reaction Details
TargetNociceptin receptor
LigandBDBM21851
Substrate/CompetitorBDBM21842
Meas. Tech.Radioligand Binding Assay
pH7.4±n/a
Temperature295.15±n/a K
Ki 6.6±1.3 nM
Citation Mustazza, CBorioni, ASestili, ISbraccia, MRodomonte, ADel Giudice, MR Synthesis and pharmacological evaluation of 1,2-dihydrospiro[isoquinoline-4(3H),4'-piperidin]-3-ones as nociceptin receptor agonists. J Med Chem51:1058-62 (2008) 
 
Nociceptin receptor
Name:Nociceptin receptor
Type:G Protein-Coupled Receptor (GPCR)
Mol. Mass.:40702.87
Organism:Homo sapiens (Human)
Description:P41146
Residue:370
BDBM21851
BDBM21842
NameBDBM21851
Synonyms:2-benzyl-1'-[4-(propan-2-yl)cyclohexyl]-2,3-dihydro-1H-spiro[isoquinoline-4,4'-piperidine]-3-one | Piperidine Derivative, 5p
TypeSmall organic molecule
Emp. Form.C29H38N2O
Mol. Mass.430.6248
SMILESCC(C)C1CCC(CC1)N1CCC2(CC1)C(=O)N(Cc1ccccc1)Cc1ccccc21