Reaction Details
TargetNociceptin receptor
LigandBDBM21856
Substrate/CompetitorBDBM21842
Meas. Tech.Radioligand Binding Assay
pH7.4±n/a
Temperature295.15±n/a K
Ki 136±38 nM
Citation Mustazza, CBorioni, ASestili, ISbraccia, MRodomonte, ADel Giudice, MR Synthesis and pharmacological evaluation of 1,2-dihydrospiro[isoquinoline-4(3H),4'-piperidin]-3-ones as nociceptin receptor agonists. J Med Chem51:1058-62 (2008) 
 
Nociceptin receptor
Name:Nociceptin receptor
Type:G Protein-Coupled Receptor (GPCR)
Mol. Mass.:40702.87
Organism:Homo sapiens (Human)
Description:P41146
Residue:370
BDBM21856
BDBM21842
NameBDBM21856
Synonyms:2-benzyl-1'-(4-tert-butylcyclohexyl)-7-fluoro-2,3-dihydro-1H-spiro[isoquinoline-4,4'-piperidine]-3-one | Piperidine Derivative, 5u
TypeSmall organic molecule
Emp. Form.C30H39FN2O
Mol. Mass.462.6419
SMILESCC(C)(C)C1CCC(CC1)N1CCC2(CC1)C(=O)N(Cc1ccccc1)Cc1cc(F)ccc21