Reaction Details
TargetNociceptin receptor
LigandBDBM21861
Substrate/CompetitorBDBM21842
Meas. Tech.Radioligand Binding Assay
pH7.4±n/a
Temperature295.15±n/a K
Ki 130±45 nM
Citation Mustazza, CBorioni, ASestili, ISbraccia, MRodomonte, ADel Giudice, MR Synthesis and pharmacological evaluation of 1,2-dihydrospiro[isoquinoline-4(3H),4'-piperidin]-3-ones as nociceptin receptor agonists. J Med Chem51:1058-62 (2008) 
 
Nociceptin receptor
Name:Nociceptin receptor
Type:G Protein-Coupled Receptor (GPCR)
Mol. Mass.:40702.87
Organism:Homo sapiens (Human)
Description:P41146
Residue:370
BDBM21861
BDBM21842
NameBDBM21861
Synonyms:N-methyl-4-phenyl-1-[4-(propan-2-yl)cyclohexyl]piperidine-4-carboxamide | Piperidine Derivative, 4j
TypeSmall organic molecule
Emp. Form.C22H34N2O
Mol. Mass.342.5182
SMILESCNC(=O)C1(CCN(CC1)C1CCC(CC1)C(C)C)c1ccccc1