Reaction Details
TargetDelta-type opioid receptor
LigandBDBM21849
Substrate/CompetitorBDBM21864
Meas. Tech.Radioligand Binding Assay
Ki>10000±n/a nM
Citation Mustazza, CBorioni, ASestili, ISbraccia, MRodomonte, ADel Giudice, MR Synthesis and pharmacological evaluation of 1,2-dihydrospiro[isoquinoline-4(3H),4'-piperidin]-3-ones as nociceptin receptor agonists. J Med Chem51:1058-62 (2008) 
 
Delta-type opioid receptor
Name:Delta-type opioid receptor
Type:G Protein-Coupled Receptor (GPCR)
Mol. Mass.:40382.98
Organism:Homo sapiens (Human)
Description:Competition binding assays were carried out using membrane preparations from transfected HN9.10 cells that constitutively expressed the delta opioid receptor.
Residue:372
BDBM21849
BDBM21864
NameBDBM21849
Synonyms:1'-(4-tert-butylcyclohexyl)-5-fluoro-2-methyl-2,3-dihydro-1H-spiro[isoquinoline-4,4'-piperidine]-3-one | Piperidine Derivative, 5n
TypeSmall organic molecule
Emp. Form.C24H35FN2O
Mol. Mass.386.5459
SMILESCN1Cc2cccc(F)c2C2(CCN(CC2)C2CCC(CC2)C(C)(C)C)C1=O