Reaction Details
TargetDelta-type opioid receptor
LigandBDBM21863
Substrate/CompetitorBDBM21864
Meas. Tech.Radioligand Binding Assay
Ki>10000±n/a nM
Citation Mustazza, CBorioni, ASestili, ISbraccia, MRodomonte, ADel Giudice, MR Synthesis and pharmacological evaluation of 1,2-dihydrospiro[isoquinoline-4(3H),4'-piperidin]-3-ones as nociceptin receptor agonists. J Med Chem51:1058-62 (2008) 
 
Delta-type opioid receptor
Name:Delta-type opioid receptor
Type:G Protein-Coupled Receptor (GPCR)
Mol. Mass.:40382.98
Organism:Homo sapiens (Human)
Description:Competition binding assays were carried out using membrane preparations from transfected HN9.10 cells that constitutively expressed the delta opioid receptor.
Residue:372
BDBM21863
BDBM21864
NameBDBM21863
Synonyms:4-phenyl-1-[4-(propan-2-yl)cyclohexyl]piperidine-4-carboxamide | Piperidine Derivative, 7d
TypeSmall organic molecule
Emp. Form.C21H32N2O
Mol. Mass.328.4916
SMILESCC(C)C1CCC(CC1)N1CCC(CC1)(C(N)=O)c1ccccc1