Reaction Details
TargetKappa-type opioid receptor
LigandBDBM21848
Substrate/CompetitorBDBM21865
Meas. Tech.Radioligand Binding Assay
Ki 178±n/a nM
Citation Mustazza, CBorioni, ASestili, ISbraccia, MRodomonte, ADel Giudice, MR Synthesis and pharmacological evaluation of 1,2-dihydrospiro[isoquinoline-4(3H),4'-piperidin]-3-ones as nociceptin receptor agonists. J Med Chem51:1058-62 (2008) 
 
Kappa-type opioid receptor
Name:Kappa-type opioid receptor
Type:G Protein-Coupled Receptor (GPCR)
Mol. Mass.:42648.76
Organism:Homo sapiens (Human)
Description:P41145
Residue:380
BDBM21848
BDBM21865
NameBDBM21848
Synonyms:1'-(4-tert-butylcyclohexyl)-2-methyl-2,3-dihydro-1H-spiro[isoquinoline-4,4'-piperidine]-3-one | Piperidine Derivative, 5m
TypeSmall organic molecule
Emp. Form.C24H36N2O
Mol. Mass.368.5554
SMILESCN1Cc2ccccc2C2(CCN(CC2)C2CCC(CC2)C(C)(C)C)C1=O