Reaction Details
TargetMu-type opioid receptor
LigandBDBM21852
Substrate/CompetitorBDBM21865
Meas. Tech.Radioligand Binding Assay
Ki 6500±n/a nM
Citation Mustazza, CBorioni, ASestili, ISbraccia, MRodomonte, ADel Giudice, MR Synthesis and pharmacological evaluation of 1,2-dihydrospiro[isoquinoline-4(3H),4'-piperidin]-3-ones as nociceptin receptor agonists. J Med Chem51:1058-62 (2008) 
 
Mu-type opioid receptor
Name:Mu-type opioid receptor
Type:G Protein-Coupled Receptor (GPCR)
Mol. Mass.:44789.51
Organism:Homo sapiens (Human)
Description:P35372
Residue:400
BDBM21852
BDBM21865
NameBDBM21852
Synonyms:2-benzyl-5-fluoro-1'-[4-(propan-2-yl)cyclohexyl]-2,3-dihydro-1H-spiro[isoquinoline-4,4'-piperidine]-3-one | Piperidine Derivative, 5q
TypeSmall organic molecule
Emp. Form.C29H37FN2O
Mol. Mass.448.6153
SMILESCC(C)C1CCC(CC1)N1CCC2(CC1)C(=O)N(Cc1ccccc1)Cc1cccc(F)c21