Reaction Details
TargetMu-type opioid receptor
LigandBDBM21855
Substrate/CompetitorBDBM21865
Meas. Tech.Radioligand Binding Assay
Ki 247±n/a nM
Citation Mustazza, CBorioni, ASestili, ISbraccia, MRodomonte, ADel Giudice, MR Synthesis and pharmacological evaluation of 1,2-dihydrospiro[isoquinoline-4(3H),4'-piperidin]-3-ones as nociceptin receptor agonists. J Med Chem51:1058-62 (2008) 
 
Mu-type opioid receptor
Name:Mu-type opioid receptor
Type:G Protein-Coupled Receptor (GPCR)
Mol. Mass.:44789.51
Organism:Homo sapiens (Human)
Description:P35372
Residue:400
BDBM21855
BDBM21865
NameBDBM21855
Synonyms:2-benzyl-1'-(4-tert-butylcyclohexyl)-5-fluoro-2,3-dihydro-1H-spiro[isoquinoline-4,4'-piperidine]-3-one | Piperidine Derivative, 5t
TypeSmall organic molecule
Emp. Form.C30H39FN2O
Mol. Mass.462.6419
SMILESCC(C)(C)C1CCC(CC1)N1CCC2(CC1)C(=O)N(Cc1ccccc1)Cc1cccc(F)c21