Reaction Details
TargetHistone acetyltransferase KAT2B
LigandBDBM371576
Substrate/Competitorn/a
Meas. Tech.PCAF AlphaLisa Binding Assay
IC50 139±n/a nM
Citation Albrecht, BKBurdick, DJCote, ADuplessis, MNasveschuk, CGTaylor, AM Therapeutic compounds and uses thereof US Patent US10239861 Publication Date 3/26/2019
 
Histone acetyltransferase KAT2B
Name:Histone acetyltransferase KAT2B
Type:PROTEIN
Mol. Mass.:93045.76
Organism:Homo sapiens (Human)
Description:ChEMBL_1502838
Residue:832
BDBM371576
NameBDBM371576
Synonyms:4-chloro-5-[[1-[(4-fluorophenyl)methyl]-3-piperidyl]amino]-2-methyl-pyridazin-3-one | US10239861, Example 56
TypeSmall organic molecule
Emp. Form.C17H20ClFN4O
Mol. Mass.350.818
SMILESCn1ncc(NC2CCCN(Cc3ccc(F)cc3)C2)c(Cl)c1=O