Reaction Details
TargetSodium channel protein type 9 subunit alpha
LigandBDBM371584
Substrate/Competitorn/a
Meas. Tech.Rubidium efflux assay
IC50 3.00±n/a nM
Citation Ramdas, VLoriya, RMBanerjee, MPatil, PRJoshi, AADatrange, LSWalke, DSKhan, THDas, AKGote, GNKalhapure, VMPalle, VPKamboj, RK Sulfonamide compounds as voltage-gated sodium channel modulators US Patent US10239869 Publication Date 3/26/2019
 
Sodium channel protein type 9 subunit alpha
Name:Sodium channel protein type 9 subunit alpha
Type:Protein
Mol. Mass.:226375.97
Organism:Homo sapiens (Human)
Description:Q15858
Residue:1988
BDBM371584
NameBDBM371584
Synonyms:(R)-4-(2-(1-Methyl-1H-pyrazol-5-yl)-4-(trifluoromethyl)phenyl)-N-(pyrimidin-4-yl) chroman-7-sulfonamide | US10239869, Example 10
TypeSmall organic molecule
Emp. Form.C24H20F3N5O3S
Mol. Mass.515.508
SMILESCn1nccc1-c1cc(ccc1[C@H]1CCOc2cc(ccc12)S(=O)(=O)Nc1ccncn1)C(F)(F)F