Reaction Details
TargetSodium channel protein type 9 subunit alpha
LigandBDBM371618
Substrate/Competitorn/a
Meas. Tech.Rubidium efflux assay
IC50 0.200±n/a nM
Citation Ramdas, VLoriya, RMBanerjee, MPatil, PRJoshi, AADatrange, LSWalke, DSKhan, THDas, AKGote, GNKalhapure, VMPalle, VPKamboj, RK Sulfonamide compounds as voltage-gated sodium channel modulators US Patent US10239869 Publication Date 3/26/2019
 
Sodium channel protein type 9 subunit alpha
Name:Sodium channel protein type 9 subunit alpha
Type:Protein
Mol. Mass.:226375.97
Organism:Homo sapiens (Human)
Description:Q15858
Residue:1988
BDBM371618
NameBDBM371618
Synonyms:(R)-4-(2-(6-Fluoropyridin-3-yl)-4-(trifluoromethyl)phenyl)-N-(pyridazin-3-yl)chromane-7-sulfonamide | US10239869, Example 42
TypeSmall organic molecule
Emp. Form.C25H18F4N4O3S
Mol. Mass.530.494
SMILESFc1ccc(cn1)-c1cc(ccc1[C@H]1CCOc2cc(ccc12)S(=O)(=O)Nc1cccnn1)C(F)(F)F