Reaction Details
TargetSodium channel protein type 9 subunit alpha
LigandBDBM371639
Substrate/Competitorn/a
Meas. Tech.Rubidium efflux assay
IC50 3.00±n/a nM
Citation Ramdas, VLoriya, RMBanerjee, MPatil, PRJoshi, AADatrange, LSWalke, DSKhan, THDas, AKGote, GNKalhapure, VMPalle, VPKamboj, RK Sulfonamide compounds as voltage-gated sodium channel modulators US Patent US10239869 Publication Date 3/26/2019
 
Sodium channel protein type 9 subunit alpha
Name:Sodium channel protein type 9 subunit alpha
Type:Protein
Mol. Mass.:226375.97
Organism:Homo sapiens (Human)
Description:Q15858
Residue:1988
BDBM371639
NameBDBM371639
Synonyms:(R)-4-(2-(2-Methylthiazol-4-yl)-4-(trifluoromethyl)phenyl)-N-(pyrimidin-2-yl)chroman-7-sulfonamide | US10239869, Example 64
TypeSmall organic molecule
Emp. Form.C24H19F3N4O3S2
Mol. Mass.532.558
SMILESCc1nc(cs1)-c1cc(ccc1[C@H]1CCOc2cc(ccc12)S(=O)(=O)Nc1ncccn1)C(F)(F)F