Reaction Details
TargetSodium channel protein type 9 subunit alpha
LigandBDBM371677
Substrate/Competitorn/a
Meas. Tech.Rubidium efflux assay
IC50 10.00±n/a nM
Citation Ramdas, VLoriya, RMBanerjee, MPatil, PRJoshi, AADatrange, LSWalke, DSKhan, THDas, AKGote, GNKalhapure, VMPalle, VPKamboj, RK Sulfonamide compounds as voltage-gated sodium channel modulators US Patent US10239869 Publication Date 3/26/2019
 
Sodium channel protein type 9 subunit alpha
Name:Sodium channel protein type 9 subunit alpha
Type:Protein
Mol. Mass.:226375.97
Organism:Homo sapiens (Human)
Description:Q15858
Residue:1988
BDBM371677
NameBDBM371677
Synonyms:4-(2-(6-ethoxypyridin-3-yl)-4-(trifluoromethyl)phenyl)-N-(pyrimidin-2-yl)chroman-7-sulfonamide | US10239869, Example 103
TypeSmall organic molecule
Emp. Form.C27H23F3N4O4S
Mol. Mass.556.556
SMILESCCOc1ccc(cn1)-c1cc(ccc1[C@H]1CCOc2cc(ccc12)S(=O)(=O)Nc1ncccn1)C(F)(F)F