Reaction Details
TargetSodium channel protein type 9 subunit alpha
LigandBDBM371697
Substrate/Competitorn/a
Meas. Tech.Rubidium efflux assay
IC50 1.000±n/a nM
Citation Ramdas, VLoriya, RMBanerjee, MPatil, PRJoshi, AADatrange, LSWalke, DSKhan, THDas, AKGote, GNKalhapure, VMPalle, VPKamboj, RK Sulfonamide compounds as voltage-gated sodium channel modulators US Patent US10239869 Publication Date 3/26/2019
 
Sodium channel protein type 9 subunit alpha
Name:Sodium channel protein type 9 subunit alpha
Type:Protein
Mol. Mass.:226375.97
Organism:Homo sapiens (Human)
Description:Q15858
Residue:1988
BDBM371697
NameBDBM371697
Synonyms:N-(6-fluoropyridin-2-yl)-4-(2-morpholino-4-(trifluoromethyl)phenyl)chroman-7-sulfonamide | US10239869, Example 123
TypeSmall organic molecule
Emp. Form.C25H23F4N3O4S
Mol. Mass.537.526
SMILESFc1cccc(NS(=O)(=O)c2ccc3[C@H](CCOc3c2)c2ccc(cc2N2CCOCC2)C(F)(F)F)n1