Reaction Details
TargetSodium channel protein type 9 subunit alpha
LigandBDBM371766
Substrate/Competitorn/a
Meas. Tech.Rubidium efflux assay
IC50 8.00±n/a nM
Citation Ramdas, VLoriya, RMBanerjee, MPatil, PRJoshi, AADatrange, LSWalke, DSKhan, THDas, AKGote, GNKalhapure, VMPalle, VPKamboj, RK Sulfonamide compounds as voltage-gated sodium channel modulators US Patent US10239869 Publication Date 3/26/2019
 
Sodium channel protein type 9 subunit alpha
Name:Sodium channel protein type 9 subunit alpha
Type:Protein
Mol. Mass.:226375.97
Organism:Homo sapiens (Human)
Description:Q15858
Residue:1988
BDBM371766
NameBDBM371766
Synonyms:2'-(7-(N-(6-fluoropyridin-2-yl)sulfamoyl)chroman-4-yl)-5'-(trifluoromethyl)-[1,1'-biphenyl]-4-carboxylic acid | US10239869, Example 192
TypeSmall organic molecule
Emp. Form.C28H20F4N2O5S
Mol. Mass.572.527
SMILESOC(=O)c1ccc(cc1)-c1cc(ccc1[C@H]1CCOc2cc(ccc12)S(=O)(=O)Nc1cccc(F)n1)C(F)(F)F