Reaction Details
TargetSodium channel protein type 9 subunit alpha
LigandBDBM371788
Substrate/Competitorn/a
Meas. Tech.Rubidium efflux assay
IC50 2.00±n/a nM
Citation Ramdas, VLoriya, RMBanerjee, MPatil, PRJoshi, AADatrange, LSWalke, DSKhan, THDas, AKGote, GNKalhapure, VMPalle, VPKamboj, RK Sulfonamide compounds as voltage-gated sodium channel modulators US Patent US10239869 Publication Date 3/26/2019
 
Sodium channel protein type 9 subunit alpha
Name:Sodium channel protein type 9 subunit alpha
Type:Protein
Mol. Mass.:226375.97
Organism:Homo sapiens (Human)
Description:Q15858
Residue:1988
BDBM371788
NameBDBM371788
Synonyms:4-(2-(3,3-difluoropropyl)-4-(trifluoromethyl)phenyl)-N-(pyridazin-3-yl)chroman-7-sulfonamide | US10239869, Example 214
TypeSmall organic molecule
Emp. Form.C23H20F5N3O3S
Mol. Mass.513.48
SMILESFC(F)CCc1cc(ccc1[C@H]1CCOc2cc(ccc12)S(=O)(=O)Nc1cccnn1)C(F)(F)F