Reaction Details
TargetClan CD, family C13, asparaginyl endopeptidase-like cysteine peptidase
LigandBDBM22135
Substrate/CompetitorBDBM22115
Meas. Tech.AE Enzyme Inhibition Assay
Temperature298.15±n/a K
IC50<1±n/a nM
Commentsextracted
Citation Götz, MGJames, KEHansell, EDvorák, JSeshaadri, ASojka, DKopácek, PMcKerrow, JHCaffrey, CRPowers, JC Aza-peptidyl Michael Acceptors. A New Class of Potent and Selective Inhibitors of Asparaginyl Endopeptidases (Legumains) from Evolutionarily Diverse Pathogens. J Med Chem51:2816-32 (2008) 
 
Clan CD, family C13, asparaginyl endopeptidase-like cysteine peptidase
Name:Clan CD, family C13, asparaginyl endopeptidase-like cysteine peptidase
Type:Enzyme
Mol. Mass.:42906.95
Organism:Trichomonas vaginalis G3
Description:A2DYT2
Residue:388
BDBM22135
BDBM22115
NameBDBM22135
Synonyms:aza-peptide Michael acceptor, 5o | benzyl N-[(1S)-1-{[(2S)-1-[(2E)-N-benzyl-3-[N-(carbamoylmethyl)hydrazido]-N-[(4-fluorophenyl)methyl]prop-2-enamide]-1-oxopropan-2-yl]carbamoyl}ethyl]carbamate
TypeSmall organic molecule
Emp. Form.C34H37FN6O7
Mol. Mass.660.692
SMILESC[C@H](NC(=O)OCc1ccccc1)C(=O)N[C@@H](C)C(=O)NN(CC(N)=O)C(=O)C=CC(=O)N(Cc1ccccc1)Cc1ccc(F)cc1