Reaction Details
TargetD(3) dopamine receptor
LigandBDBM50192447
Substrate/Competitorn/a
Meas. Tech.[125I]-7OH-PIPAT Binding Assay
Ki 0.550±n/a nM
Citation Cremonesi, SMicheli, FSemerano, TTarsi, L Dopamine D3 receptor antagonists US Patent US10239870 Publication Date 3/26/2019
 
D(3) dopamine receptor
Name:D(3) dopamine receptor
Type:Protein
Mol. Mass.:49540.58
Organism:Rattus norvegicus (Rat)
Description:P19020
Residue:446
BDBM50192447
NameBDBM50192447
Synonyms:CHEMBL3975989 | US10239870, Example 53
TypeSmall organic molecule
Emp. Form.C23H26F3N5OS
Mol. Mass.477.546
SMILESCc1ncoc1-c1nnc(SCCCN2CC[C@@]3(C[C@@H]3c3ccccc3C(F)(F)F)C2)n1C