Reaction Details
TargetReceptor-interacting serine/threonine-protein kinase 2
LigandBDBM372158
Substrate/Competitorn/a
Meas. Tech.RIPK2 Inhibition Assay
IC50<100±n/a nM
Citation Laufer, RNg, GBrokx, RPauls, HWLi, SMason, JMBray, MR RIPK2 inhibitors and method of treating cancer with same US Patent US10239881 Publication Date 3/26/2019
 
Receptor-interacting serine/threonine-protein kinase 2
Name:Receptor-interacting serine/threonine-protein kinase 2
Type:Protein
Mol. Mass.:61201.30
Organism:Homo sapiens (Human)
Description:n/a
Residue:540
BDBM372158
NameBDBM372158
Synonyms:N-(3-(4- methylpiperazin-1- yl)phenyl)-6- (thiophen-3-yl)-5H- pyrrolo[3,2- d]pyrimidin-2- amine US10875863, Example A11
TypeSmall organic molecule
Emp. Form.C21H22N6S
Mol. Mass.390.505
SMILESCN1CCN(CC1)c1cccc(Nc2ncc3[nH]c(cc3n2)-c2ccsc2)c1