Reaction Details
TargetReceptor-interacting serine/threonine-protein kinase 2
LigandBDBM372159
Substrate/Competitorn/a
Meas. Tech.RIPK2 Inhibition Assay
IC50<100±n/a nM
Citation Laufer, RNg, GBrokx, RPauls, HWLi, SMason, JMBray, MR RIPK2 inhibitors and method of treating cancer with same US Patent US10239881 Publication Date 3/26/2019
 
Receptor-interacting serine/threonine-protein kinase 2
Name:Receptor-interacting serine/threonine-protein kinase 2
Type:Protein
Mol. Mass.:61201.30
Organism:Homo sapiens (Human)
Description:n/a
Residue:540
BDBM372159
NameBDBM372159
Synonyms:6-(2,6- dimethylphenyl)- N-(3- morpholinophenyl)- 5H-pyrrolo[3,2- d ]pyrimidin-2- amine US10875863, Example A12
TypeSmall organic molecule
Emp. Form.C24H25N5O
Mol. Mass.399.4882
SMILESCc1cccc(C)c1-c1cc2nc(Nc3cccc(c3)N3CCOCC3)ncc2[nH]1