Reaction Details
TargetReceptor-interacting serine/threonine-protein kinase 2
LigandBDBM372161
Substrate/Competitorn/a
Meas. Tech.RIPK2 Inhibition Assay
IC50>500±n/a nM
Citation Laufer, RNg, GBrokx, RPauls, HWLi, SMason, JMBray, MR RIPK2 inhibitors and method of treating cancer with same US Patent US10239881 Publication Date 3/26/2019
 
Receptor-interacting serine/threonine-protein kinase 2
Name:Receptor-interacting serine/threonine-protein kinase 2
Type:Protein
Mol. Mass.:61201.30
Organism:Homo sapiens (Human)
Description:n/a
Residue:540
BDBM372161
NameBDBM372161
Synonyms:N-(3- morpholino- phenyl)-6- (tetrahydro-2H- pyran-4-yl)- 5H-pyrrolo[3,2-d] pyrimidin-2-amine US10875863, Example A14
TypeSmall organic molecule
Emp. Form.C21H25N5O2
Mol. Mass.379.4555
SMILESC1CC(CCO1)c1cc2nc(Nc3cccc(c3)N3CCOCC3)ncc2[nH]1