Reaction Details
TargetReceptor-interacting serine/threonine-protein kinase 2
LigandBDBM372167
Substrate/Competitorn/a
Meas. Tech.RIPK2 Inhibition Assay
IC50<100±n/a nM
Citation Laufer, RNg, GBrokx, RPauls, HWLi, SMason, JMBray, MR RIPK2 inhibitors and method of treating cancer with same US Patent US10239881 Publication Date 3/26/2019
 
Receptor-interacting serine/threonine-protein kinase 2
Name:Receptor-interacting serine/threonine-protein kinase 2
Type:Protein
Mol. Mass.:61201.30
Organism:Homo sapiens (Human)
Description:n/a
Residue:540
BDBM372167
NameBDBM372167
Synonyms:6-(2-chloro- phenyl)-N- (3-morpholino- phenyl)- 5H-pyrrolo[3,2- d]pyrimidin-2- amine US10875863, Example A20
TypeSmall organic molecule
Emp. Form.C22H20ClN5O
Mol. Mass.405.88
SMILESClc1ccccc1-c1cc2nc(Nc3cccc(c3)N3CCOCC3)ncc2[nH]1