Reaction Details
TargetReceptor-interacting serine/threonine-protein kinase 2
LigandBDBM372168
Substrate/Competitorn/a
Meas. Tech.RIPK2 Inhibition Assay
IC50 300±n/a nM
Citation Laufer, RNg, GBrokx, RPauls, HWLi, SMason, JMBray, MR RIPK2 inhibitors and method of treating cancer with same US Patent US10239881 Publication Date 3/26/2019
 
Receptor-interacting serine/threonine-protein kinase 2
Name:Receptor-interacting serine/threonine-protein kinase 2
Type:Protein
Mol. Mass.:61201.30
Organism:Homo sapiens (Human)
Description:n/a
Residue:540
BDBM372168
NameBDBM372168
Synonyms:(1r,4)-4-((6- (o-tolyl)- 5H-pyrrolo[3,2- d]pyrimidin-2- yl)amino) cyclohexanol US10239881, Example A22 | US10875863, Example A22
TypeSmall organic molecule
Emp. Form.C19H22N4O
Mol. Mass.322.4042
SMILESCc1ccccc1-c1cc2nc(N[C@@H]3CC[C@H](O)CC3)ncc2[nH]1