Reaction Details
TargetSeed linoleate 13S-lipoxygenase-1
LigandBDBM22348
Substrate/CompetitorBDBM22231
Meas. Tech.COX Inhibitor Screening Assay
IC50 360±n/a nM
Citation Rao, PNChen, QHKnaus, EE Synthesis and structure-activity relationship studies of 1,3-diarylprop-2-yn-1-ones: dual inhibitors of cyclooxygenases and lipoxygenases. J Med Chem49:1668-83 (2006) 
 
Seed linoleate 13S-lipoxygenase-1
Name:Seed linoleate 13S-lipoxygenase-1
Type:Enzyme
Mol. Mass.:94365.66
Organism:Glycine max (soybean)
Description:n/a
Residue:839
BDBM22348
BDBM22231
NameBDBM22348
Synonyms:1,3-Diarylprop-2-yn-1-one, 13e | 3-(4-methanesulfonylphenyl)-1-[4-(propan-2-yl)phenyl]prop-2-yn-1-one
TypeSmall organic molecule
Emp. Form.C19H18O3S
Mol. Mass.326.409
SMILESCC(C)c1ccc(cc1)C(=O)C#Cc1ccc(cc1)S(C)(=O)=O