Reaction Details
TargetSeed linoleate 13S-lipoxygenase-1
LigandBDBM22372
Substrate/CompetitorBDBM22231
Meas. Tech.COX Inhibitor Screening Assay
IC50 3500±n/a nM
Citation Rao, PNChen, QHKnaus, EE Synthesis and structure-activity relationship studies of 1,3-diarylprop-2-yn-1-ones: dual inhibitors of cyclooxygenases and lipoxygenases. J Med Chem49:1668-83 (2006) 
 
Seed linoleate 13S-lipoxygenase-1
Name:Seed linoleate 13S-lipoxygenase-1
Type:Enzyme
Mol. Mass.:94365.66
Organism:Glycine max (soybean)
Description:n/a
Residue:839
BDBM22372
BDBM22231
NameBDBM22372
Synonyms:4-[(2R,3S)-4-(3,4-dihydroxyphenyl)-2,3-dimethylbutyl]benzene-1,2-diol CHEMBL313972 NDGA | Nordihydroguaiaretic Acid
TypeAntioxidant
Emp. Form.C18H22O4
Mol. Mass.302.3649
SMILESC[C@@H](Cc1ccc(O)c(O)c1)[C@H](C)Cc1ccc(O)c(O)c1