Reaction Details
TargetSodium-dependent dopamine transporter
LigandBDBM22412
Substrate/CompetitorBDBM22397
Meas. Tech.Ligand Binding Assay
pH7.4±n/a
Temperature277.15±n/a K
IC50 4±1 nM
Citation Gong, PKBlough, BEBrieaddy, LEHuang, XKuhar, MJNavarro, HACarroll, FI Synthesis, monoamine transporter binding, properties, and functional monoamine uptake activity of 3beta-[4-methylphenyl and 4-chlorophenyl]-2 beta-[5-(substituted phenyl)thiazol-2-yl]tropanes. J Med Chem50:3686-95 (2007) 
 
Sodium-dependent dopamine transporter
Name:Sodium-dependent dopamine transporter
Type:Multi-pass membrane protein
Mol. Mass.:68749.45
Organism:Rattus norvegicus (rat)
Description:P23977
Residue:619
BDBM22412
BDBM22397
NameBDBM22412
Synonyms:2-[(1R,2S,3S,5S)-8-methyl-3-(4-methylphenyl)-8-azabicyclo[3.2.1]octan-2-yl]-5-(3-nitrophenyl)-1,3-thiazole | WIN 35,065-2 Analogue, 4p
TypeSmall organic molecule
Emp. Form.C24H25N3O2S
Mol. Mass.419.539
SMILESCN1[C@H]2CC[C@@H]1[C@H]([C@H](C2)c1ccc(C)cc1)c1ncc(s1)-c1cccc(c1)[N+]([O-])=O