Reaction Details
TargetSodium-dependent serotonin transporter
LigandBDBM22412
Substrate/CompetitorBDBM22416
Meas. Tech.Ligand Binding Assay
Ki 10000±n/a nM
Citation Gong, PKBlough, BEBrieaddy, LEHuang, XKuhar, MJNavarro, HACarroll, FI Synthesis, monoamine transporter binding, properties, and functional monoamine uptake activity of 3beta-[4-methylphenyl and 4-chlorophenyl]-2 beta-[5-(substituted phenyl)thiazol-2-yl]tropanes. J Med Chem50:3686-95 (2007) 
 
Sodium-dependent serotonin transporter
Name:Sodium-dependent serotonin transporter
Type:Multi-pass membrane protein
Mol. Mass.:70168.43
Organism:Rattus norvegicus (rat)
Description:P31652
Residue:630
BDBM22412
BDBM22416
NameBDBM22412
Synonyms:2-[(1R,2S,3S,5S)-8-methyl-3-(4-methylphenyl)-8-azabicyclo[3.2.1]octan-2-yl]-5-(3-nitrophenyl)-1,3-thiazole | WIN 35,065-2 Analogue, 4p
TypeSmall organic molecule
Emp. Form.C24H25N3O2S
Mol. Mass.419.539
SMILESCN1[C@H]2CC[C@@H]1[C@H]([C@H](C2)c1ccc(C)cc1)c1ncc(s1)-c1cccc(c1)[N+]([O-])=O