Reaction Details
TargetMetabotropic glutamate receptor 5
LigandBDBM372963
Substrate/Competitorn/a
Meas. Tech.[3H]-M-MPEP Radioligand Binding Assay
Ki 2.75±n/a nM
Citation Christopher, JACongreve, MSAves, SJTehan, BG 4-(3-cyanophenyl)-6-pyridinylpyrimidine mGlu5 modulators US Patent US10246432 Publication Date 4/2/2019
 
Metabotropic glutamate receptor 5
Name:Metabotropic glutamate receptor 5
Type:Enzyme
Mol. Mass.:132484.72
Organism:Homo sapiens (Human)
Description:n/a
Residue:1212
BDBM372963
NameBDBM372963
Synonyms:3-methyl-5-[6-(pyridin- US10584111, Ex No. 4 | US11584732, Example 4
TypeSmall organic molecule
Emp. Form.C17H12N4
Mol. Mass.272.304
SMILESCc1cc(cc(c1)-c1cc(ncn1)-c1ccccn1)C#N