Reaction Details
TargetMetabotropic glutamate receptor 5
LigandBDBM50113466
Substrate/Competitorn/a
Meas. Tech.[3H]-M-MPEP Radioligand Binding Assay
Ki 4.07±n/a nM
Citation Christopher, JACongreve, MSAves, SJTehan, BG 4-(3-cyanophenyl)-6-pyridinylpyrimidine mGlu5 modulators US Patent US10246432 Publication Date 4/2/2019
 
Metabotropic glutamate receptor 5
Name:Metabotropic glutamate receptor 5
Type:Enzyme
Mol. Mass.:132484.72
Organism:Homo sapiens (Human)
Description:n/a
Residue:1212
BDBM50113466
NameBDBM50113466
Synonyms:CHEMBL3603913 US10584111, Ex No. 13 | US11584732, Example 13
TypeSmall organic molecule
Emp. Form.C15H11N5
Mol. Mass.261.2813
SMILESCc1cc(cc(c1)-c1cc(ncn1)-n1cccn1)C#N